BDBM50366986 CHEMBL607779
SMILES OC[C@H]1OC([C@H](O)[C@@H]1O)N1CCCCNC1=O
InChI Key InChIKey=XFBDBFJTEFLACS-BYBOBHAWSA-N
Data  3 KI
  Tab Delimited (TSV)   2D SDfile   Computed 3D by Vconf -m prep SDfile
Find this compound or compounds like it in BindingDB:
Activity Spreadsheet -- Enzyme Inhibition Constant Data from BindingDB
Found 3 hits for monomerid = 50366986
TargetCytidine deaminase(Mus musculus)
TBA
Curated by ChEMBL
LigandPNGBDBM50366986(CHEMBL607779)
Affinity DataKi:  300nM. Assay description: Cytidine Deaminase Inhibition in mouse KidneyChecked by Author
In DepthDetails ArticlePubMed
TargetCytidine deaminase(Homo sapiens (Human))
Harvard University
Curated by ChEMBL
LigandPNGBDBM50366986(CHEMBL607779)
Affinity DataKi:  400nM. Assay description: Binding affinity for human cytidine deaminase
In DepthDetails ArticlePubMed
TargetCytidine deaminase(Homo sapiens (Human))
Harvard University
Curated by ChEMBL
LigandPNGBDBM50366986(CHEMBL607779)
Affinity DataKi:  400nM. Assay description: Cytidine Deaminase Inhibition in human liverChecked by Author
In DepthDetails ArticlePubMed