BDBM50367035 CHEMBL608655
SMILES OC[C@H]1OC([C@H](O)[C@@H]1O)N1CCNC1=O
InChI Key InChIKey=AZBBWEJRVMCCTH-RKEPMNIXSA-N
Data  2 KI
  Tab Delimited (TSV)   2D SDfile   Computed 3D by Vconf -m prep SDfile
Find this compound or compounds like it in BindingDB:
Activity Spreadsheet -- Enzyme Inhibition Constant Data from BindingDB
Found 2 hits for monomerid = 50367035
TargetCytidine deaminase(Mus musculus)
TBA
Curated by ChEMBL
LigandPNGBDBM50367035(CHEMBL608655)
Affinity DataKi:  2.00E+5nM. Assay description: Binding affinity against cytidine deaminase of mouse kidney
In DepthDetails ArticlePubMed
TargetCytidine deaminase(Homo sapiens (Human))
TBA
Curated by ChEMBL
LigandPNGBDBM50367035(CHEMBL608655)
Affinity DataKi:  3.00E+5nM. Assay description: Binding affinity against cytidine deaminase of human liver
In DepthDetails ArticlePubMed