BDBM50367038 CHEMBL604815
SMILES CCC[C@H](OP(O)(=O)OP(O)(=O)OP(O)(O)=O)[C@H]1OC([C@H](O)[C@@H]1O)n1cnc2c(N)ncnc12
InChI Key InChIKey=DTPQBXDJPLZKNI-HBVTWTNQSA-N
Data  2 KI
  Tab Delimited (TSV)   2D SDfile   Computed 3D by Vconf -m prep SDfile
Find this compound or compounds like it in BindingDB:
Activity Spreadsheet -- Enzyme Inhibition Constant Data from BindingDB
Found 2 hits for monomerid = 50367038
TargetAdenylate kinase isoenzyme 1(Rattus norvegicus)
TBA
Curated by ChEMBL
LigandPNGBDBM50367038(CHEMBL604815)
Affinity DataKi:  3.00E+5nM. Assay description: Inhibitory activity against rat Adenylate kinase M isoenzyme in the presence of AMP competitive inhibition
In DepthDetails ArticlePubMed
TargetAdenylate kinase 2, mitochondrial(Rattus norvegicus)
TBA
Curated by ChEMBL
LigandPNGBDBM50367038(CHEMBL604815)
Affinity DataKi:  4.50E+5nM. Assay description: Inhibitory activity against rat adenylate kinase II was determined in the presence of ATP,competitive inhibition
In DepthDetails ArticlePubMed