BDBM50367208 CHEMBL612139
SMILES OC[C@H]1OC([C@H](O)[C@@H]1O)n1cnc2cccnc12
InChI Key InChIKey=JVODRKOKQFRWIN-YIPHXTPMSA-N
Data  1 KI
  Tab Delimited (TSV)   2D SDfile   Computed 3D by Vconf -m prep SDfile
Find this compound or compounds like it in BindingDB:
Activity Spreadsheet -- Enzyme Inhibition Constant Data from BindingDB
Found 1 hit for monomerid = 50367208
TargetAdenosine deaminase(Bos taurus (bovine))
TBA
Curated by ChEMBL
LigandPNGBDBM50367208(CHEMBL612139)
Affinity DataKi:  4.20E+4nM. Assay description: Binding affinity against calf intestine adenosine deaminase enzyme
In DepthDetails ArticlePubMed