BDBM50367223 CHEMBL4160527
SMILES [Na;v0+].[#6]-[#8]-c1cc(c(F)cn1)-c1ccc(-[#6]-2-[#6]-[#6]-c3ccc(cc3-[#8]-2)-[#6@@H](-[#6@H](-[#6])-[#6](-[#8-])=O)-[#6]-2-[#6]-[#6]-2)c(F)c1
InChI Key InChIKey=QLIWVYFLNVKIHM-GFTAQQBESA-M
Data  4 EC50
  Tab Delimited (TSV)   2D SDfile   Computed 3D by Vconf -m prep SDfile
Find this compound or compounds like it in BindingDB:
Activity Spreadsheet -- Enzyme Inhibition Constant Data from BindingDB
Found 4 hits for monomerid = 50367223
TargetFree fatty acid receptor 1(Homo sapiens (Human))
Merck
Curated by ChEMBL
LigandPNGBDBM50367223(CHEMBL4160527)
Affinity DataEC50:  328nM. Assay description: Agonist activity at recombinant human GPR40 expressed in HEK293 cells assessed as increase in IP1 accumulation measured after 60 mins in presence of ...
In DepthDetails ArticlePubMed
TargetFree fatty acid receptor 1(Homo sapiens (Human))
Merck
Curated by ChEMBL
LigandPNGBDBM50367223(CHEMBL4160527)
Affinity DataEC50:  328nM. Assay description: Agonist activity at recombinant human GPR40 expressed in HEK293 cells assessed as increase in IP1 accumulation measured after 60 mins in presence of ...
In DepthDetails ArticlePubMed
TargetFree fatty acid receptor 1(Homo sapiens (Human))
Merck
Curated by ChEMBL
LigandPNGBDBM50367223(CHEMBL4160527)
Affinity DataEC50: <0.200nM. Assay description: Agonist activity at recombinant human GPR40 expressed in HEK293 cells assessed as increase in IP1 accumulation measured after 60 mins by HTRF assay
In DepthDetails ArticlePubMed
TargetFree fatty acid receptor 1(Homo sapiens (Human))
Merck
Curated by ChEMBL
LigandPNGBDBM50367223(CHEMBL4160527)
Affinity DataEC50:  1.20nM. Assay description: Agonist activity at recombinant human GPR40 expressed in HEK293 cells assessed as increase in IP1 accumulation measured after 60 mins by HTRF assay
In DepthDetails ArticlePubMed