BDBM50367241 CHEMBL4160127
SMILES OC(=O)C[C@@H](C1CC1)c1ccc2CCC(Oc2c1)c1ccc(cc1)-c1ccccc1
InChI Key InChIKey=CPGRWGLOIUMQIF-SKCDSABHSA-N
Data  2 EC50
  Tab Delimited (TSV)   2D SDfile   Computed 3D by Vconf -m prep SDfile
Find this compound or compounds like it in BindingDB:
Activity Spreadsheet -- Enzyme Inhibition Constant Data from BindingDB
Found 2 hits for monomerid = 50367241
TargetFree fatty acid receptor 1(Homo sapiens (Human))
Merck
Curated by ChEMBL
LigandPNGBDBM50367241(CHEMBL4160127)
Affinity DataEC50:  133nM. Assay description: Agonist activity at recombinant human GPR40 expressed in HEK293 cells assessed as increase in IP1 accumulation measured after 60 mins by HTRF assay
In DepthDetails ArticlePubMed
TargetFree fatty acid receptor 1(Homo sapiens (Human))
Merck
Curated by ChEMBL
LigandPNGBDBM50367241(CHEMBL4160127)
Affinity DataEC50:  5.44E+3nM. Assay description: Agonist activity at recombinant human GPR40 expressed in HEK293 cells assessed as increase in IP1 accumulation measured after 60 mins in presence of ...
In DepthDetails ArticlePubMed