BDBM50367345 CHEMBL604220
SMILES OC[C@H]1OC([C@H](O)[C@@H]1O)N1CCC=NC1=O
InChI Key InChIKey=IETQKJGVIZCNAZ-XDTPYFJJSA-N
Data  1 KI
  Tab Delimited (TSV)   2D SDfile   Computed 3D by Vconf -m prep SDfile
Find this compound or compounds like it in BindingDB:
Activity Spreadsheet -- Enzyme Inhibition Constant Data from BindingDB
Found 1 hit for monomerid = 50367345
TargetCytidine deaminase(Mus musculus)
TBA
Curated by ChEMBL
LigandPNGBDBM50367345(CHEMBL604220)
Affinity DataKi:  4.00E+3nM. Assay description: Compound was tested for the inhibitory constant for mouse kidney cytidine deaminase
In DepthDetails ArticlePubMed