BDBM50367459 CHEMBL1202810
SMILES CCOc1ccc(Cc2nc3c(O)ccc(C)c3[nH]2)cc1
InChI Key InChIKey=JPOYYOYPWKSBPL-UHFFFAOYSA-N
Data  1 IC50
  Tab Delimited (TSV)   2D SDfile   Computed 3D by Vconf -m prep SDfile
Find this compound or compounds like it in BindingDB:
Activity Spreadsheet -- Enzyme Inhibition Constant Data from BindingDB
Found 1 hit for monomerid = 50367459
TargetPolyunsaturated fatty acid 5-lipoxygenase(Rattus norvegicus)
Beecham Pharmaceuticals Research Division
Curated by ChEMBL
LigandPNGBDBM50367459(CHEMBL1202810)
Affinity DataIC50:  3.00E+3nM. Assay description: In vitro inhibition of RBL-1 5-lipoxygenase; Value ranges from 2.3-.8
In DepthDetails ArticlePubMed