BDBM50367575 CHEMBL1743819
SMILES Oc1ccc(cc1O)[C@@H]1CN2CCC[C@@H]2c2ccccc12
InChI Key InChIKey=ARHOPMHKOMJLQF-JKSUJKDBSA-N
Data  5 KI
  Tab Delimited (TSV)   2D SDfile   Computed 3D by Vconf -m prep SDfile
Find this compound or compounds like it in BindingDB:
Activity Spreadsheet -- Enzyme Inhibition Constant Data from BindingDB
Found 5 hits for monomerid = 50367575
TargetTransporter(Rattus norvegicus)
TBA
Curated by ChEMBL
LigandPNGBDBM50367575(CHEMBL1743819)
Affinity DataKi:  0.810nM. Assay description: Inhibition of uptake of tritiated norepinephrine (NE) in rat synaptosomes
In DepthDetails ArticlePubMed
TargetSodium-dependent dopamine transporter(Rattus norvegicus (rat))
TBA
Curated by ChEMBL
LigandPNGBDBM50367575(CHEMBL1743819)
Affinity DataKi:  10nM. Assay description: Inhibition of the uptake of tritiated dopamine (DA) in rat synaptosomes
In DepthDetails ArticlePubMed
TargetSodium-dependent serotonin transporter(Rattus norvegicus (rat))
TBA
Curated by ChEMBL
LigandPNGBDBM50367575(CHEMBL1743819)
Affinity DataKi:  33nM. Assay description: Inhibition the uptake of tritiated serotonin (5-HT) by the serotonin transporter SERT in rat synaptosomes
In DepthDetails ArticlePubMed
TargetAlpha-1A/Alpha-1B/Alpha-1D adrenergic receptor(Rattus norvegicus (rat))
TBA
Curated by ChEMBL
LigandPNGBDBM50367575(CHEMBL1743819)
Affinity DataKi:  675nM. Assay description: Binding affinity towards alpha-1 adrenergic receptor
In DepthDetails ArticlePubMed
TargetD(1A) dopamine receptor(RAT)
TBA
Curated by ChEMBL
LigandPNGBDBM50367575(CHEMBL1743819)
Affinity DataKi: >1.00E+3nM. Assay description: Binding affinity towards Dopamine receptor D1
In DepthDetails ArticlePubMed