BDBM50368385 CHEMBL4174809
SMILES COc1ccc(Nc2nc(nc3ccc(cc23)[N+]([O-])=O)-c2cccnc2)cc1
InChI Key InChIKey=NHRFTZLPNSUWGW-UHFFFAOYSA-N
Data  1 IC50
  Tab Delimited (TSV)   2D SDfile   Computed 3D by Vconf -m prep SDfile
Find this compound or compounds like it in BindingDB:
Activity Spreadsheet -- Enzyme Inhibition Constant Data from BindingDB
Found 1 hit for monomerid = 50368385
TargetBroad substrate specificity ATP-binding cassette transporter ABCG2(Homo sapiens (Human))
University Of Bonn
Curated by ChEMBL
LigandPNGBDBM50368385(CHEMBL4174809)
Affinity DataIC50:  58nM. Assay description: Inhibition of c-terminal GFP-tagged human ABCG2 expressed in MDCK2 cells preincubated for 30 mins before Hoechst 33342 addition by Hoechst 33342 accu...
In DepthDetails ArticlePubMed