BDBM50368802 CHEMBL1791097
SMILES CC[C@@H](C)[C@H](NC(=O)[C@H](CC1CCCCC1)NC(=O)CCC(O)=O)C(=O)N[C@@H](Cc1ccc2ccccc2c1)[C@@H](O)[C@@H](O)CC(C)C
InChI Key InChIKey=DXQWXYPROWODLY-CVAXMTBMSA-N
Data  2 IC50
  Tab Delimited (TSV)   2D SDfile   Computed 3D by Vconf -m prep SDfile
Find this compound or compounds like it in BindingDB:
Activity Spreadsheet -- Enzyme Inhibition Constant Data from BindingDB
Found 2 hits for monomerid = 50368802
TargetCathepsin D(Bos taurus)
Abbott Laboratories
Curated by ChEMBL
LigandPNGBDBM50368802(CHEMBL1791097)
Affinity DataIC50:  60nM. Assay description: Inhibition of conversion of hemoglobin by commercially purchased bovine spleen cathepsin D.
In DepthDetails ArticlePubMed
TargetEndothelin-converting enzyme 1(Rattus norvegicus (Rat))
Abbott Laboratories
Curated by ChEMBL
LigandPNGBDBM50368802(CHEMBL1791097)
Affinity DataIC50:  3.10nM. Assay description: Inhibition of conversion of big endothelial-1 (Big ET-1) to ET-1 by endothelin converting enzyme(ECE) in rat lung membrane.
In DepthDetails ArticlePubMed