BDBM50368806 CHEMBL1791099
SMILES CC[C@@H](C)[C@H](NC(=O)OC(C)(C)C)C(=O)N[C@@H]([C@H](C)CC)C(=O)N[C@@H](CC(C)C)C(O)CC(=O)NC[C@@H](C)O
InChI Key InChIKey=WSOXTVRJXIBZOX-ZDNXQIFVSA-N
Data  2 IC50
  Tab Delimited (TSV)   2D SDfile   Computed 3D by Vconf -m prep SDfile
Find this compound or compounds like it in BindingDB:
Activity Spreadsheet -- Enzyme Inhibition Constant Data from BindingDB
Found 2 hits for monomerid = 50368806
TargetEndothelin-converting enzyme 1(Rattus norvegicus (Rat))
Abbott Laboratories
Curated by ChEMBL
LigandPNGBDBM50368806(CHEMBL1791099)
Affinity DataIC50:  15nM. Assay description: Inhibition of conversion of big endothelial-1 (Big ET-1) to ET-1 by endothelin converting enzyme(ECE) in rat lung membrane.
In DepthDetails ArticlePubMed
TargetCathepsin D(Bos taurus)
Abbott Laboratories
Curated by ChEMBL
LigandPNGBDBM50368806(CHEMBL1791099)
Affinity DataIC50:  120nM. Assay description: Inhibition of conversion of hemoglobin by commercially purchased bovine spleen cathepsin D.
In DepthDetails ArticlePubMed