BDBM50368809 CHEMBL4163562
SMILES C[C@H]1CCN(CCOc2ccc(cc2)C2Oc3ccc(O)cc3C(C)=C2c2cccc(O)c2)C1
InChI Key InChIKey=GPURPDIEDCPRPM-KCHZNAQISA-N
Data  1 IC50
  Tab Delimited (TSV)   2D SDfile   Computed 3D by Vconf -m prep SDfile
Find this compound or compounds like it in BindingDB:
Activity Spreadsheet -- Enzyme Inhibition Constant Data from BindingDB
Found 1 hit for monomerid = 50368809
TargetEstrogen receptor(Homo sapiens (Human))
TBA
Curated by ChEMBL
LigandPNGBDBM50368809(CHEMBL4163562)
Affinity DataIC50:  0.200nM. Assay description: Induction of ERalpha degradation in human MCF7 cells in phenol red free RPMI medium containing 5% charcoal dextran-treated FBS incubated for 4 hrs by...
In DepthDetails ArticlePubMed