BDBM50368812 CHEMBL4159900
SMILES C[C@@H](COc1ccc(cc1)C1Oc2ccc(O)cc2C(C)=C1c1cccc(c1)S(C)(=O)=O)N1CC[C@@H](C)C1
InChI Key InChIKey=MXBBPIJEMQRQDA-JDLBOKMSSA-N
Data  1 IC50
  Tab Delimited (TSV)   2D SDfile   Computed 3D by Vconf -m prep SDfile
Find this compound or compounds like it in BindingDB:
Activity Spreadsheet -- Enzyme Inhibition Constant Data from BindingDB
Found 1 hit for monomerid = 50368812
TargetEstrogen receptor(Homo sapiens (Human))
TBA
Curated by ChEMBL
LigandPNGBDBM50368812(CHEMBL4159900)
Affinity DataIC50:  1.40nM. Assay description: Induction of ERalpha degradation in human MCF7 cells in phenol red free RPMI medium containing 5% charcoal dextran-treated FBS incubated for 4 hrs by...
In DepthDetails ArticlePubMed