BDBM50368862 CHEMBL4176563
SMILES CC1CCN(CCOc2ccc(cc2)C2Oc3ccc(O)cc3C(C)=C2c2cccc(O)c2)CC1
InChI Key InChIKey=AMQJPZHBETWGKB-UHFFFAOYSA-N
Data  1 IC50
  Tab Delimited (TSV)   2D SDfile   Computed 3D by Vconf -m prep SDfile
Find this compound or compounds like it in BindingDB:
Activity Spreadsheet -- Enzyme Inhibition Constant Data from BindingDB
Found 1 hit for monomerid = 50368862
TargetEstrogen receptor(Homo sapiens (Human))
TBA
Curated by ChEMBL
LigandPNGBDBM50368862(CHEMBL4176563)
Affinity DataIC50:  0.200nM. Assay description: Induction of ERalpha degradation in human MCF7 cells in phenol red free RPMI medium containing 5% charcoal dextran-treated FBS incubated for 4 hrs by...
In DepthDetails ArticlePubMed