BDBM50368864 CHEMBL4168008
SMILES C[C@@H](COc1ccc(cc1)C1Oc2ccc(O)cc2C(C)=C1c1cccc(O)c1)N1CCCCC1
InChI Key InChIKey=ZMMPPCWVFJVHTL-JGZNSJETSA-N
Data  1 IC50
  Tab Delimited (TSV)   2D SDfile   Computed 3D by Vconf -m prep SDfile
Find this compound or compounds like it in BindingDB:
Activity Spreadsheet -- Enzyme Inhibition Constant Data from BindingDB
Found 1 hit for monomerid = 50368864
TargetEstrogen receptor(Homo sapiens (Human))
TBA
Curated by ChEMBL
LigandPNGBDBM50368864(CHEMBL4168008)
Affinity DataIC50:  0.200nM. Assay description: Induction of ERalpha degradation in human MCF7 cells in phenol red free RPMI medium containing 5% charcoal dextran-treated FBS incubated for 4 hrs by...
In DepthDetails ArticlePubMed