BDBM50369720 CHEMBL3979355
SMILES [H][C@@]1(CCCN(C1)C(=O)C(=C\C(C)(C)N1CCN(CC1)C1COC1)\C#N)n1nc(-c2ccc(Oc3ccccc3)cc2F)c2c(N)ncnc12
InChI Key InChIKey=LCFFREMLXLZNHE-GRBCXPRBSA-N
Data  4 IC50
  Tab Delimited (TSV)   2D SDfile   Computed 3D by Vconf -m prep SDfile
Find this compound or compounds like it in BindingDB:
Activity Spreadsheet -- Enzyme Inhibition Constant Data from BindingDB
Found 4 hits for monomerid = 50369720
TargetReceptor tyrosine-protein kinase erbB-4(Homo sapiens (Human))
Shaanxi University Of Science & Technology
Curated by ChEMBL
LigandPNGBDBM50369720(CHEMBL3979355)
Affinity DataIC50:  11nM. Assay description: Inhibition of ErbB4/HER4 (unknown origin)
In DepthDetails ArticlePubMed
TargetTyrosine-protein kinase BTK(Homo sapiens (Human))
Principia Biopharma, A Sanofi
Curated by ChEMBL
LigandPNGBDBM50369720(CHEMBL3979355)
Affinity DataIC50:  4.20nM. Assay description: Inhibition of BTK (unknown origin) using peptide substrate in presence of ATP by caliper electrophoresis method
In DepthDetails PubMed
TargetTyrosine-protein kinase BTK(Homo sapiens (Human))
Principia Biopharma, A Sanofi
Curated by ChEMBL
LigandPNGBDBM50369720(CHEMBL3979355)
Affinity DataIC50:  1.30nM. Assay description: Inhibition of BTK (unknown origin)
In DepthDetails ArticlePubMed
LigandPNGBDBM50369720(CHEMBL3979355)
Affinity DataIC50: >5nM. Assay description: Inhibition of JAK (unknown origin)
In DepthDetails ArticlePubMed