BDBM50369768 CHEMBL1791134
SMILES CC[C@@H](C)[C@@H]1NC(=O)[C@@H](NC(=O)[C@H](CCCCCC(=O)CC)NC(=O)[C@H]2CCCCN2C1=O)c1cn(C)c2ccccc2c1=O
InChI Key InChIKey=MBUPURNAOZZFIU-XFOPQCFPSA-N
Data  1 IC50
  Tab Delimited (TSV)   2D SDfile   Computed 3D by Vconf -m prep SDfile
Find this compound or compounds like it in BindingDB:
Activity Spreadsheet -- Enzyme Inhibition Constant Data from BindingDB
Found 1 hit for monomerid = 50369768
TargetHistone deacetylase(Cryptosporidium parvum)
Merck Research Laboratories
Curated by ChEMBL
LigandPNGBDBM50369768(CHEMBL1791134)
Affinity DataIC50:  9nM. Assay description: Tested for Histone deacetylase enzyme inhibition assay using Eimeria tenella extract
In DepthDetails ArticlePubMed