BDBM50370047 CHEMBL1744280
SMILES CC(c1cnc[nH]1)c1scc(Br)c1Br
InChI Key InChIKey=YCEJIRSLWBFIQA-UHFFFAOYSA-N
Data  1 KI
  Tab Delimited (TSV)   2D SDfile   Computed 3D by Vconf -m prep SDfile
Find this compound or compounds like it in BindingDB:
Activity Spreadsheet -- Enzyme Inhibition Constant Data from BindingDB
Found 1 hit for monomerid = 50370047
TargetAlpha-1D adrenergic receptor(Homo sapiens (Human))
The R. W. Johnson Pharmaceutical Research Institute
Curated by ChEMBL
LigandPNGBDBM50370047(CHEMBL1744280)
Affinity DataKi:  0.430nM. Assay description: In vitro binding affinity against alpha-2D adrenergic receptor of male Wistar rat
In DepthDetails ArticlePubMed