BDBM50370389 CHEMBL1201843
SMILES Cc1ccc(c(CNC(=O)CN2CC(NC=C2)=NCC(F)(F)c2ccccn2)c1)-n1cncn1
InChI Key InChIKey=DBOFDHWOVYKUFV-UHFFFAOYSA-N
Data  1 KI
  Tab Delimited (TSV)   2D SDfile   Computed 3D by Vconf -m prep SDfile
Find this compound or compounds like it in BindingDB:
Activity Spreadsheet -- Enzyme Inhibition Constant Data from BindingDB
Found 1 hit for monomerid = 50370389
TargetProthrombin(Homo sapiens (Human))
Merck Research Laboratories
Curated by ChEMBL
LigandPNGBDBM50370389(CHEMBL1201843)
Affinity DataKi:  0.240nM. Assay description: Inhibitory potency against human thrombin
In DepthDetails ArticlePubMed