BDBM50370391 CHEMBL175813
SMILES O=C(Nc1ccc(cc1)C(=O)N1CCCCc2sccc12)c1ccccc1-c1ccccc1
InChI Key InChIKey=FCTSOYFQOMNNFT-UHFFFAOYSA-N
Data  2 IC50
  Tab Delimited (TSV)   2D SDfile   Computed 3D by Vconf -m prep SDfile
Find this compound or compounds like it in BindingDB:
Activity Spreadsheet -- Enzyme Inhibition Constant Data from BindingDB
Found 2 hits for monomerid = 50370391
TargetVasopressin V2 receptor(Homo sapiens (Human))
TBA
Curated by ChEMBL
LigandPNGBDBM50370391(CHEMBL175813)
Affinity DataIC50:  5nM. Assay description: Inhibitory activity against human recombinant arginine vasopressin V2 receptor using [3H]AVP as radioligand in CHO cells
In DepthDetails ArticlePubMed
TargetVasopressin V2 receptor(Rattus norvegicus (Rat))
TBA
Curated by ChEMBL
LigandPNGBDBM50370391(CHEMBL175813)
Affinity DataIC50:  310nM. Assay description: Inhibitory activity against arginine vasopressin V2 receptor using [3H]AVP as radioligand in rat adrenal medulla
In DepthDetails ArticlePubMed