BDBM50370396 CHEMBL178591
SMILES CCCCCCCCCC[C@@H]1[C@H](N(C1=O)c1ccc(OC)cc1)c1ccccc1
InChI Key InChIKey=XICXLYHRUHIKDF-JWQCQUIFSA-N
Data  1 IC50
  Tab Delimited (TSV)   2D SDfile   Computed 3D by Vconf -m prep SDfile
Find this compound or compounds like it in BindingDB:
Activity Spreadsheet -- Enzyme Inhibition Constant Data from BindingDB
Found 1 hit for monomerid = 50370396
TargetSterol O-acyltransferase 1(Homo sapiens (Human))
TBA
Curated by ChEMBL
LigandPNGBDBM50370396(CHEMBL178591)
Affinity DataIC50: >1.00E+4nM. Assay description: Inhibition of Acyl coenzyme A:cholesterol acyltransferase (ACAT)
In DepthDetails ArticlePubMed