BDBM50370667 CHEMBL555246
SMILES CCCCC1(CCCC)CS(=O)(=O)c2ccc(cc2[C@H]([C@H]1O)c1cccc(NC(=O)CCCC[N+](CC)(CC)CC)c1)N(C)C
InChI Key InChIKey=UFIAGUICOZKHHJ-LQFQNGICSA-O
Data  1 IC50
  Tab Delimited (TSV)   2D SDfile   Computed 3D by Vconf -m prep SDfile
Find this compound or compounds like it in BindingDB:
Activity Spreadsheet -- Enzyme Inhibition Constant Data from BindingDB
Found 1 hit for monomerid = 50370667
TargetIleal sodium/bile acid cotransporter(Homo sapiens (Human))
Pfizer
Curated by ChEMBL
LigandPNGBDBM50370667(CHEMBL555246)
Affinity DataIC50:  0.760nM. Assay description: In vitro inhibition of ASBT mediated uptake of [14C]taurocholate (5 uM) in baby hamster cells expressing human IBAT
In DepthDetails ArticlePubMed