BDBM50371256 CHEMBL1162967
SMILES COc1ccc(\C=N/OC2CCN(C2C(=O)NC(CCC(O)=O)C(=O)NC(CCC(O)=O)C(N)=O)C(=O)C2CCCCN2C(=O)C(C)NC(=O)C(NC(=O)C2CCCN2C(=O)C(CCC(O)=O)NC(=O)C2CCCN2C(=O)CCCCNC(=S)Nc2ccc3C(=O)OC4(c3c2)c2ccc(O)cc2Oc2cc(O)ccc42)C(C)O)cc1O
InChI Key InChIKey=AZJIJWKIROGNEA-TXQLIGRWSA-N
Data  1 IC50
  Tab Delimited (TSV)   2D SDfile   Computed 3D by Vconf -m prep SDfile
Find this compound or compounds like it in BindingDB:
Activity Spreadsheet -- Enzyme Inhibition Constant Data from BindingDB
Found 1 hit for monomerid = 50371256
TargetTumor susceptibility gene 101 protein(Homo sapiens (Human))
Nih
Curated by ChEMBL
LigandPNGBDBM50371256(CHEMBL1162967)
Affinity DataIC50:  1.30E+4nM. Assay description: Binding affinity to Tsg101
In DepthDetails ArticlePubMed