BDBM50371394 CHEMBL258604
SMILES NC(=O)C(c1ccccc1)(c1ccccc1)c1ccc(F)cc1
InChI Key InChIKey=JHPLFDBQYVMFCT-UHFFFAOYSA-N
Data  1 IC50
  Tab Delimited (TSV)   2D SDfile   Computed 3D by Vconf -m prep SDfile
Find this compound or compounds like it in BindingDB:
Activity Spreadsheet -- Enzyme Inhibition Constant Data from BindingDB
Found 1 hit for monomerid = 50371394
LigandPNGBDBM50371394(CHEMBL258604)
Affinity DataIC50:  40nM. Assay description: Inhibition of Gardos channel in human RBC assessed as inhibition of ionomycin-stimulated [86Rb] efflux
In DepthDetails ArticlePubMed