BDBM50371404 MERIOLIN 1
SMILES Nc1nccc(n1)-c1c[nH]c2ncccc12
InChI Key InChIKey=HQHSJJZIICGOIX-UHFFFAOYSA-N
Data  15 IC50
  Tab Delimited (TSV)   2D SDfile   Computed 3D by Vconf -m prep SDfile
Find this compound or compounds like it in BindingDB:
Activity Spreadsheet -- Enzyme Inhibition Constant Data from BindingDB
Found 15 hits for monomerid = 50371404
LigandPNGBDBM50371404(MERIOLIN 1)
Affinity DataIC50: >1.00E+4nM. Assay description: Inhibition of PI3K alpha (unknown origin)
In DepthDetails ArticlePubMed
TargetCyclin-A2/Cyclin-dependent kinase 2(Homo sapiens (Human))
Csir-Indian Institute Of Integrative Medicine
Curated by ChEMBL
LigandPNGBDBM50371404(MERIOLIN 1)
Affinity DataIC50:  90nM. Assay description: Inhibition of CDK9/cyclin T (unknown origin) using YSPTSPSYSPTSPSYSPTSPKKK as substrate after 30 mins in presence of [33P]-gamma-ATP
In DepthDetails ArticlePubMed
LigandPNGBDBM50371404(MERIOLIN 1)
Affinity DataIC50: >1.00E+4nM. Assay description: Inhibition of PI3K delta (unknown origin)
In DepthDetails ArticlePubMed
Target3-phosphoinositide-dependent protein kinase 1(Homo sapiens (Human))
Merck
Curated by ChEMBL
LigandPNGBDBM50371404(MERIOLIN 1)
Affinity DataIC50:  5.90E+3nM. Assay description: Inhibition of human His6-tagged PDK1 using biotinylated PDKtide as substrate after 60 mins by topcount method
In DepthDetails ArticlePubMed
Target3-phosphoinositide-dependent protein kinase 1(Homo sapiens (Human))
Merck
Curated by ChEMBL
LigandPNGBDBM50371404(MERIOLIN 1)
Affinity DataIC50: >1.00E+4nM. Assay description: Inhibition of PDK1 in human PC3 cells assessed as reduction in AKT Thr308 phosphorylation after 45 mins
In DepthDetails ArticlePubMed
Target3-phosphoinositide-dependent protein kinase 1(Homo sapiens (Human))
Merck
Curated by ChEMBL
LigandPNGBDBM50371404(MERIOLIN 1)
Affinity DataIC50:  5.90E+3nM. Assay description: Inhibition of human PDK1
In DepthDetails ArticlePubMed
LigandPNGBDBM50371404(MERIOLIN 1)
Affinity DataIC50:  130nM. Assay description: Inhibition of rat recombinant GST-DYRK1A expressed in Escherichia coli
In DepthDetails ArticlePubMed
TargetCyclin-A2/Cyclin-dependent kinase 2(Homo sapiens (Human))
Csir-Indian Institute Of Integrative Medicine
Curated by ChEMBL
LigandPNGBDBM50371404(MERIOLIN 1)
Affinity DataIC50:  90nM. Assay description: Inhibition of human recombinant CDK2/cyclin A expressed in insect cells
In DepthDetails ArticlePubMed
TargetCyclin-T1/Cyclin-dependent kinase 9(Homo sapiens (Human))
University Of Oxford
Curated by ChEMBL
LigandPNGBDBM50371404(MERIOLIN 1)
Affinity DataIC50:  26nM. Assay description: Inhibition of human recombinant CDK9/cyclin T expressed in insect cells
In DepthDetails ArticlePubMed
TargetCyclin-T1/Cyclin-dependent kinase 9(Homo sapiens (Human))
University Of Oxford
Curated by ChEMBL
LigandPNGBDBM50371404(MERIOLIN 1)
Affinity DataIC50:  26nM. Assay description: Inhibition of human recombinant CDK9/cyclin T expressed in baculovirus infected Sf9 insect cells using pRB (773 to 928 residues) as substrate after 3...
In DepthDetails ArticlePubMed
TargetCyclin-A2/Cyclin-dependent kinase 2(Homo sapiens (Human))
Csir-Indian Institute Of Integrative Medicine
Curated by ChEMBL
LigandPNGBDBM50371404(MERIOLIN 1)
Affinity DataIC50:  90nM. Assay description: Inhibition of human recombinant CDK2/cyclin A after 30 mins by [gamma-33P]ATP based scintillation counting analysis
In DepthDetails ArticlePubMed
TargetCyclin-dependent kinase 5 activator 1(Homo sapiens (Human))
University Of Nebraska Medical Center
Curated by ChEMBL
LigandPNGBDBM50371404(MERIOLIN 1)
Affinity DataIC50:  510nM. Assay description: Inhibition of human recombinant CDK5/p25 expressed in baculovirus infected Sf9 insect cells after 30 mins by [gamma-33P]ATP based scintillation count...
In DepthDetails ArticlePubMed
TargetCyclin-dependent kinase 5 activator 1(Homo sapiens (Human))
University Of Nebraska Medical Center
Curated by ChEMBL
LigandPNGBDBM50371404(MERIOLIN 1)
Affinity DataIC50:  510nM. Assay description: Inhibition of recombinant GST-CDK5/p25 expressed in Escherichia coli
In DepthDetails ArticlePubMed
TargetCyclin-T1/Cyclin-dependent kinase 9(Homo sapiens (Human))
University Of Oxford
Curated by ChEMBL
LigandPNGBDBM50371404(MERIOLIN 1)
Affinity DataIC50:  30nM. Assay description: Inhibition of CDK9/cyclin T (unknown origin) using YSPTSPSYSPTSPSYSPTSPKKK as substrate after 30 mins in presence of [33P]-gamma-ATP
In DepthDetails ArticlePubMed
LigandPNGBDBM50371404(MERIOLIN 1)
Affinity DataIC50: >1.00E+4nM. Assay description: Inhibition of PI3K gamma (unknown origin)
In DepthDetails ArticlePubMed