BDBM50372084 CHEMBL271262
SMILES CC12CCC(C)(O1)c1c(O)n(c(O)c21)-c1c(N)ccc2ncsc12
InChI Key InChIKey=DBJACYOUNOWPDG-UHFFFAOYSA-N
Data  1 KI  1 IC50
  Tab Delimited (TSV)   2D SDfile   Computed 3D by Vconf -m prep SDfile
Find this compound or compounds like it in BindingDB:
Activity Spreadsheet -- Enzyme Inhibition Constant Data from BindingDB
Found 2 hits for monomerid = 50372084
TargetAndrogen receptor(Homo sapiens (Human))
Bristol-Myers Squibb Pharmaceutical Research And Development
Curated by ChEMBL
LigandPNGBDBM50372084(CHEMBL271262)
Affinity DataKi:  17nM. Assay description: Displacement of [3H]DHT from human androgen receptor in MDA453 cells
In DepthDetails ArticlePubMed
TargetAndrogen receptor(Homo sapiens (Human))
Bristol-Myers Squibb Pharmaceutical Research And Development
Curated by ChEMBL
LigandPNGBDBM50372084(CHEMBL271262)
Affinity DataIC50:  120nM. Assay description: Antagonist activity at human androgen receptor in MDA453 cells by alkaline phosphatase reporter gene assay
In DepthDetails ArticlePubMed