BDBM50372089 CHEMBL272509
SMILES CSc1cc(ccc1C#N)-n1c(O)c2c(c1O)C1(C)CCC2(C)O1
InChI Key InChIKey=NFBXLEONIGSXFZ-UHFFFAOYSA-N
Data  1 KI  1 IC50
  Tab Delimited (TSV)   2D SDfile   Computed 3D by Vconf -m prep SDfile
Find this compound or compounds like it in BindingDB:
Activity Spreadsheet -- Enzyme Inhibition Constant Data from BindingDB
Found 2 hits for monomerid = 50372089
TargetAndrogen receptor(Homo sapiens (Human))
Bristol-Myers Squibb Pharmaceutical Research And Development
Curated by ChEMBL
LigandPNGBDBM50372089(CHEMBL272509)
Affinity DataKi:  3nM. Assay description: Displacement of [3H]DHT from human androgen receptor in MDA453 cells
In DepthDetails ArticlePubMed
TargetAndrogen receptor(Homo sapiens (Human))
Bristol-Myers Squibb Pharmaceutical Research And Development
Curated by ChEMBL
LigandPNGBDBM50372089(CHEMBL272509)
Affinity DataIC50:  19nM. Assay description: Antagonist activity at human androgen receptor in MDA453 cells by alkaline phosphatase reporter gene assay
In DepthDetails ArticlePubMed