BDBM50372099 CHEMBL437214
SMILES Cc1ccc(cc1Cl)-n1c(O)c2C3CCC(O3)c2c1O
InChI Key InChIKey=BSWCEHOILOHQCN-UHFFFAOYSA-N
Data  1 KI  1 IC50
  Tab Delimited (TSV)   2D SDfile   Computed 3D by Vconf -m prep SDfile
Find this compound or compounds like it in BindingDB:
Activity Spreadsheet -- Enzyme Inhibition Constant Data from BindingDB
Found 2 hits for monomerid = 50372099
TargetAndrogen receptor(Homo sapiens (Human))
Bristol-Myers Squibb Pharmaceutical Research And Development
Curated by ChEMBL
LigandPNGBDBM50372099(CHEMBL437214)
Affinity DataKi:  486nM. Assay description: Displacement of [3H]DHT from human androgen receptor in MDA453 cells
In DepthDetails ArticlePubMed
TargetAndrogen receptor(Homo sapiens (Human))
Bristol-Myers Squibb Pharmaceutical Research And Development
Curated by ChEMBL
LigandPNGBDBM50372099(CHEMBL437214)
Affinity DataIC50:  2.29E+3nM. Assay description: Antagonist activity at human androgen receptor in MDA453 cells by alkaline phosphatase reporter gene assay
In DepthDetails ArticlePubMed