BDBM50372773 CHEMBL401577
SMILES O=C(NC1CCCCC1)C1C(=O)NC(CCc2ccccc2)C1=O
InChI Key InChIKey=VCKJRJLSUNFZNW-UHFFFAOYSA-N
Data  1 IC50
  Tab Delimited (TSV)   2D SDfile   Computed 3D by Vconf -m prep SDfile
Find this compound or compounds like it in BindingDB:
Activity Spreadsheet -- Enzyme Inhibition Constant Data from BindingDB
Found 1 hit for monomerid = 50372773
TargetIsoprenyl transferase(Streptococcus pneumoniae)
Novartis Institutes For Biomedical Research
Curated by ChEMBL
LigandPNGBDBM50372773(CHEMBL401577)
Affinity DataIC50:  3.50E+4nM. Assay description: Inhibition of Streptococcus pneumoniae UPPS
In DepthDetails ArticlePubMed