BDBM50373072 CHEMBL402005
SMILES [O-][N+](=O)c1cc(ccc1NCCS1=CC=CC=C1)S(=O)(=O)NC(=O)c1ccc(cc1)-c1ccc(F)cc1
InChI Key InChIKey=USCVBLRITFTCIJ-UHFFFAOYSA-N
Data  1 IC50
  Tab Delimited (TSV)   2D SDfile   Computed 3D by Vconf -m prep SDfile
Find this compound or compounds like it in BindingDB:
Activity Spreadsheet -- Enzyme Inhibition Constant Data from BindingDB
Found 1 hit for monomerid = 50373072
TargetBcl2-associated agonist of cell death(Homo sapiens (Human))
University Of California San Francisco
Curated by ChEMBL
LigandPNGBDBM50373072(CHEMBL402005)
Affinity DataIC50:  36nM. Assay description: Binding affinity to Bcl-XL
In DepthDetails ArticlePubMed