BDBM50374777 CHEMBL428255
SMILES Cc1cc(SCc2csnc2-c2ccc(cc2)C(F)(F)F)ccc1OCC(O)=O
InChI Key InChIKey=HXACRUNQCCKYND-UHFFFAOYSA-N
Data  2 EC50
  Tab Delimited (TSV)   2D SDfile   Computed 3D by Vconf -m prep SDfile
Find this compound or compounds like it in BindingDB:
Activity Spreadsheet -- Enzyme Inhibition Constant Data from BindingDB
Found 2 hits for monomerid = 50374777
TargetPeroxisome proliferator-activated receptor alpha(Homo sapiens (Human))
Johnson & Johnson Pharmaceutical Research And Development
Curated by ChEMBL
LigandPNGBDBM50374777(CHEMBL428255)
Affinity DataEC50: >3.00E+3nM. Assay description: Agonist activity at human PPARalpha-Gal4 in HEK293 cells by luciferase reporter assay
In DepthDetails ArticlePubMed
TargetPeroxisome proliferator-activated receptor delta(Homo sapiens (Human))
Johnson & Johnson Pharmaceutical Research And Development
Curated by ChEMBL
LigandPNGBDBM50374777(CHEMBL428255)
Affinity DataEC50:  150nM. Assay description: Agonist activity at human PPARdelta-Gal4 in HEK293 cells by luciferase reporter assay
In DepthDetails ArticlePubMed