BDBM50375073 CHEMBL402340
SMILES CNCCc1cn(C2=C(C(=O)NC2=O)c2c[nH]c3ccc(Cl)cc23)c2ccccc12
InChI Key InChIKey=DUVQBXZJIAXQEK-UHFFFAOYSA-N
Data  1 IC50
  Tab Delimited (TSV)   2D SDfile   Computed 3D by Vconf -m prep SDfile
Find this compound or compounds like it in BindingDB:
Activity Spreadsheet -- Enzyme Inhibition Constant Data from BindingDB
Found 1 hit for monomerid = 50375073
LigandPNGBDBM50375073(CHEMBL402340)
Affinity DataIC50:  13nM. Assay description: Inhibition of CaMK2delta
In DepthDetails ArticlePubMed