BDBM50375783 CHEMBL407492
SMILES CN(C)CCC(=O)c1cccs1
InChI Key InChIKey=JNMZUWJMJSKMON-UHFFFAOYSA-N
Data  1 KI  2 IC50
  Tab Delimited (TSV)   2D SDfile   Computed 3D by Vconf -m prep SDfile
Find this compound or compounds like it in BindingDB:
Activity Spreadsheet -- Enzyme Inhibition Constant Data from BindingDB
Found 3 hits for monomerid = 50375783
TargetSortase family protein(Staphylococcus aureus)
University Of Chicago
Curated by ChEMBL
LigandPNGBDBM50375783(CHEMBL407492)
Affinity DataKi:  9.32E+4nM. Assay description: Inhibition of Staphylococcus aureus sortase A
In DepthDetails ArticlePubMed
TargetSortase family protein(Staphylococcus aureus)
University Of Chicago
Curated by ChEMBL
LigandPNGBDBM50375783(CHEMBL407492)
Affinity DataIC50:  4.70E+4nM. Assay description: Inhibition of human recombinant soluble CD69 receptor by direct binding assay
In DepthDetails PubMed
TargetSortase family protein(Staphylococcus aureus)
University Of Chicago
Curated by ChEMBL
LigandPNGBDBM50375783(CHEMBL407492)
Affinity DataIC50:  4.70E+4nM. Assay description: Inhibition of Staphylococcus aureus sortase A
In DepthDetails ArticlePubMed