BDBM50376612 CHEMBL261049
SMILES OC(=O)CSc1ccc(CN(Cc2ccc(cc2)-c2csnn2)S(=O)(=O)c2ccccc2)cc1
InChI Key InChIKey=JDZNBTGSUJDVRJ-UHFFFAOYSA-N
Data  1 IC50
  Tab Delimited (TSV)   2D SDfile   Computed 3D by Vconf -m prep SDfile
Find this compound or compounds like it in BindingDB:
Activity Spreadsheet -- Enzyme Inhibition Constant Data from BindingDB
Found 1 hit for monomerid = 50376612
TargetTyrosine-protein phosphatase non-receptor type 1(Homo sapiens (Human))
Affymax
Curated by ChEMBL
LigandPNGBDBM50376612(CHEMBL261049)
Affinity DataIC50:  1.15E+5nM. Assay description: Inhibition of PTP1B
In DepthDetails ArticlePubMed