BDBM50376627 CHEMBL409926
SMILES OC(=O)COc1ccc(cc1)S(=O)(=O)N(Cc1ccc(CP(O)(O)=O)cc1)Cc1ccc(cc1)-c1csnn1
InChI Key InChIKey=XLXYFRXMAMZHPW-UHFFFAOYSA-N
Data  1 IC50
  Tab Delimited (TSV)   2D SDfile   Computed 3D by Vconf -m prep SDfile
Find this compound or compounds like it in BindingDB:
Activity Spreadsheet -- Enzyme Inhibition Constant Data from BindingDB
Found 1 hit for monomerid = 50376627
TargetTyrosine-protein phosphatase non-receptor type 1(Homo sapiens (Human))
Affymax
Curated by ChEMBL
LigandPNGBDBM50376627(CHEMBL409926)
Affinity DataIC50:  9.68E+4nM. Assay description: Inhibition of PTP1B
In DepthDetails ArticlePubMed