BDBM50376920 CHEMBL259575
SMILES CCCCn1n(Cc2ccc(cc2)-c2ccccc2-c2nnn[nH]2)c2nc(Cl)c(F)cc2c1=O
InChI Key InChIKey=TVOTUWSBAXNGEN-UHFFFAOYSA-N
Data  1 IC50
  Tab Delimited (TSV)   2D SDfile   Computed 3D by Vconf -m prep SDfile
Find this compound or compounds like it in BindingDB:
Activity Spreadsheet -- Enzyme Inhibition Constant Data from BindingDB
Found 1 hit for monomerid = 50376920
TargetType-1 angiotensin II receptor A(RAT)
Universit£
Curated by ChEMBL
LigandPNGBDBM50376920(CHEMBL259575)
Affinity DataIC50:  427nM. Assay description: Displacement of [125I]Sar1,Ile8-Ang2 from AT1 receptor in Wistar rat hepatic membrane
In DepthDetails ArticlePubMed