BDBM50377603 CHEMBL402002
SMILES Clc1ccc(NC(=O)c2ccccc2SCc2ccncc2)cc1
InChI Key InChIKey=VEGDXHXEGCZBEY-UHFFFAOYSA-N
Data  1 IC50
  Tab Delimited (TSV)   2D SDfile   Computed 3D by Vconf -m prep SDfile
Find this compound or compounds like it in BindingDB:
Activity Spreadsheet -- Enzyme Inhibition Constant Data from BindingDB
Found 1 hit for monomerid = 50377603
TargetVascular endothelial growth factor receptor 2(Homo sapiens (Human))
Santen Pharmaceutical
Curated by ChEMBL
LigandPNGBDBM50377603(CHEMBL402002)
Affinity DataIC50:  46nM. Assay description: Inhibition of KDR by ELISA
In DepthDetails ArticlePubMed