BDBM50377626 CHEMBL254786
SMILES [#6]-c1ccnc(c1)C(F)(F)[#6]-[#7]-c1ccc(C#N)c(-[#6]-[#6](=O)-[#7]-[#6]-[#6]-[#8]\[#7]=[#6](\[#7])-[#7])c1F
InChI Key InChIKey=QSBUUBXMFWELHB-UHFFFAOYSA-N
Data  1 KI
  Tab Delimited (TSV)   2D SDfile   Computed 3D by Vconf -m prep SDfile
Find this compound or compounds like it in BindingDB:
Activity Spreadsheet -- Enzyme Inhibition Constant Data from BindingDB
Found 1 hit for monomerid = 50377626
TargetProthrombin(Homo sapiens (Human))
Johnson & Johnson Pharmaceutical Research & Development
Curated by ChEMBL
LigandPNGBDBM50377626(CHEMBL254786)
Affinity DataKi:  2.90nM. Assay description: Binding affinity to human thrombin
In DepthDetails ArticlePubMed