BDBM50378500 CHEMBL577411
SMILES CCOC(=O)c1ncn-2c1Cn1cnnc1-c1cc(Cl)ccc-21
InChI Key InChIKey=NEVSBYUBNOGFQJ-UHFFFAOYSA-N
Data  1 KI
  Tab Delimited (TSV)   2D SDfile   Computed 3D by Vconf -m prep SDfile
Find this compound or compounds like it in BindingDB:
Activity Spreadsheet -- Enzyme Inhibition Constant Data from BindingDB
Found 1 hit for monomerid = 50378500
TargetGABA-A receptor; alpha-5/beta-3/gamma-2(Homo sapiens (Human))
F. Hoffmann-La Roche
Curated by ChEMBL
LigandPNGBDBM50378500(CHEMBL577411)
Affinity DataKi:  1.20nM. Assay description: Binding affinity to GABAA alpha-5-beta-3-gamma-2 receptor
In DepthDetails ArticlePubMed