BDBM50378914 CHEMBL2011213
SMILES COc1ccc(NC(=O)NCCNC[C@H](O)COc2ccccc2C#N)cc1
InChI Key InChIKey=UCHSWQOJMMBBFQ-KRWDZBQOSA-N
Data  1 IC50
  Tab Delimited (TSV)   2D SDfile   Computed 3D by Vconf -m prep SDfile
Find this compound or compounds like it in BindingDB:
Activity Spreadsheet -- Enzyme Inhibition Constant Data from BindingDB
Found 1 hit for monomerid = 50378914
TargetBeta-1 adrenergic receptor(Homo sapiens (Human))
TBA
Curated by ChEMBL
LigandPNGBDBM50378914(CHEMBL2011213)
Affinity DataIC50:  0.110nM. Assay description: Displacement of [3H](-)-CGP-12177 from adrenergic beta1 receptor by cell based assay
In DepthDetails ArticlePubMed