BDBM50379013 CHEMBL2011591
SMILES CN1CCN(CC1)c1nc2ccccc2c(C(=O)NCCCCCCCNC(=O)NCC(O)=O)c1C
InChI Key InChIKey=WAXMULZSNYUPJB-UHFFFAOYSA-N
Data  1 KI
  Tab Delimited (TSV)   2D SDfile   Computed 3D by Vconf -m prep SDfile
Find this compound or compounds like it in BindingDB:
Activity Spreadsheet -- Enzyme Inhibition Constant Data from BindingDB
Found 1 hit for monomerid = 50379013
Target5-hydroxytryptamine receptor 3A(RAT)
TBA
Curated by ChEMBL
LigandPNGBDBM50379013(CHEMBL2011591)
Affinity DataKi:  26nM. Assay description: Displacement of [3H]granisetron from 5HT3 receptor in Wistar rat cortical membranes by liquid scintillation spectrometery
In DepthDetails ArticlePubMed