BDBM50379017 CHEMBL2011595
SMILES CN1CCN(CC1)c1nc2ccccc2c(C(=O)NCCCCCCNC(=O)OC(C)(C)C)c1C
InChI Key InChIKey=QPTXZWUCCHJHIL-UHFFFAOYSA-N
Data  1 KI
  Tab Delimited (TSV)   2D SDfile   Computed 3D by Vconf -m prep SDfile
Find this compound or compounds like it in BindingDB:
Activity Spreadsheet -- Enzyme Inhibition Constant Data from BindingDB
Found 1 hit for monomerid = 50379017
Target5-hydroxytryptamine receptor 3A(RAT)
TBA
Curated by ChEMBL
LigandPNGBDBM50379017(CHEMBL2011595)
Affinity DataKi:  178nM. Assay description: Displacement of [3H]granisetron from 5HT3 receptor in Wistar rat cortical membranes by liquid scintillation spectrometery
In DepthDetails ArticlePubMed