BDBM50380698 CHEMBL2017514
SMILES CCOP(=O)(OCC)C(Cc1cccc(OC)c1)c1sc2ccccc2c1C
InChI Key InChIKey=PGDONWXUSQVACW-UHFFFAOYSA-N
Data  1 IC50
  Tab Delimited (TSV)   2D SDfile   Computed 3D by Vconf -m prep SDfile
Find this compound or compounds like it in BindingDB:
Activity Spreadsheet -- Enzyme Inhibition Constant Data from BindingDB
Found 1 hit for monomerid = 50380698
TargetTransient receptor potential M8 protein(Canis lupus familiaris (Dog))
Janssen Pharmaceutica
Curated by ChEMBL
LigandPNGBDBM50380698(CHEMBL2017514)
Affinity DataIC50:  121nM. Assay description: Antagonist activity at dog TRPM8 expressed in HEK293 cells assessed as inhibition of icilin-induced increase in intracellular Ca2+ level measured eve...
In DepthDetails ArticlePubMed