BDBM50382193 CHEMBL2023846
SMILES Clc1ccc(cc1)-c1csc(Nc2ccc(Oc3ccccc3)cc2)n1
InChI Key InChIKey=NDCHOZNNVSQVJC-UHFFFAOYSA-N
Data  1 IC50  1 EC50
  Tab Delimited (TSV)   2D SDfile   Computed 3D by Vconf -m prep SDfile
Find this compound or compounds like it in BindingDB:
Activity Spreadsheet -- Enzyme Inhibition Constant Data from BindingDB
Found 2 hits for monomerid = 50382193
TargetProstaglandin G/H synthase 2(Homo sapiens (Human))
The University Of Arizona
Curated by ChEMBL
LigandPNGBDBM50382193(CHEMBL2023846)
Affinity DataIC50: >1.00E+4nM. Assay description: Inhibition of COX2 by fluorescence assay
In DepthDetails ArticlePubMed
TargetProstaglandin G/H synthase 2(Homo sapiens (Human))
The University Of Arizona
Curated by ChEMBL
LigandPNGBDBM50382193(CHEMBL2023846)
Affinity DataEC50:  330nM. Assay description: Inhibition of COX-2 (unknown origin)
In DepthDetails ArticlePubMed