BDBM50382295 CHEMBL2024507
SMILES CC(=O)N[C@H]1CC[C@H](CCN2CCC(Cc3cccc(c3)C(F)(F)F)CC2)CC1
InChI Key InChIKey=ACKBCTLAXFJWPZ-LBZQVFOQSA-N
Data  2 IC50
  Tab Delimited (TSV)   2D SDfile   Computed 3D by Vconf -m prep SDfile
Find this compound or compounds like it in BindingDB:
Activity Spreadsheet -- Enzyme Inhibition Constant Data from BindingDB
Found 2 hits for monomerid = 50382295
TargetD(2) dopamine receptor(Rattus norvegicus (rat))
Gedeon Richter
Curated by ChEMBL
LigandPNGBDBM50382295(CHEMBL2024507)
Affinity DataIC50:  64nM. Assay description: Displacement of [3H]spiperone from dopamine D2 receptor in rat striatal membranes
In DepthDetails ArticlePubMed
TargetD(3) dopamine receptor(Rattus norvegicus (Rat))
Gedeon Richter
Curated by ChEMBL
LigandPNGBDBM50382295(CHEMBL2024507)
Affinity DataIC50:  3.30nM. Assay description: Displacement of [3H]spiperone from rat recombinant dopamine D3 receptor expressed in Sf9 cells
In DepthDetails ArticlePubMed