BDBM50383794 CHEMBL2030798
SMILES CNc1cccc(CCOc2ccc(C[C@H](NC(=O)c3ccccc3Cl)C(O)=O)cc2)n1
InChI Key InChIKey=WYPGVVZBOCXSCK-NRFANRHFSA-N
Data  5 IC50
  Tab Delimited (TSV)   2D SDfile   Computed 3D by Vconf -m prep SDfile
Find this compound or compounds like it in BindingDB:
Activity Spreadsheet -- Enzyme Inhibition Constant Data from BindingDB
Found 5 hits for monomerid = 50383794
TargetIntegrin alpha-5/beta-1(Homo sapiens (Human))
Astrazeneca
Curated by ChEMBL
LigandPNGBDBM50383794(CHEMBL2030798)
Affinity DataIC50:  42nM. Assay description: Antagonist activity at integrin alpha5beta1 in human K562 cells assessed as inhibition of cell adhesion
In DepthDetails ArticlePubMed
TargetIntegrin alpha-5/beta-1(Homo sapiens (Human))
Astrazeneca
Curated by ChEMBL
LigandPNGBDBM50383794(CHEMBL2030798)
Affinity DataIC50:  3nM. Assay description: Binding affinity to integrin alpha5beta1
In DepthDetails ArticlePubMed
TargetIntegrin alpha-5/beta-1(Homo sapiens (Human))
Astrazeneca
Curated by ChEMBL
LigandPNGBDBM50383794(CHEMBL2030798)
Affinity DataIC50: >2.60E+4nM. Assay description: Antagonist activity at integrin alpha5beta1 in human K562 cells assessed as inhibition of cell adhesion in presence of human serum albumin
In DepthDetails ArticlePubMed
TargetIntegrin alpha-V/beta-3(Homo sapiens (Human))
Astrazeneca
Curated by ChEMBL
LigandPNGBDBM50383794(CHEMBL2030798)
Affinity DataIC50:  520nM. Assay description: Antagonist activity at integrin alphaVbeta3 in human A375M cells assessed as cell adhesion to fibrinogen in presence of Mg2+
In DepthDetails ArticlePubMed
TargetIntegrin alpha-5/beta-1(Homo sapiens (Human))
Astrazeneca
Curated by ChEMBL
LigandPNGBDBM50383794(CHEMBL2030798)
Affinity DataIC50:  240nM. Assay description: Antagonist activity at integrin alpha5beta1 in human A375M cells assessed as inhibition of cell adhesion in presence of Mg2+ and MK-0429
In DepthDetails ArticlePubMed