BDBM50383881 CHEMBL2031457
SMILES O=C(NC1CCCC1)c1ccc(OCc2ccc3ccccc3n2)cc1[C@@]1(C[C@H]2CC[C@H]1C2)c1ccccc1
InChI Key InChIKey=ILFBQZYFGGMJJQ-KXGUNYDHSA-N
Data  2 IC50
  Tab Delimited (TSV)   2D SDfile   Computed 3D by Vconf -m prep SDfile
Find this compound or compounds like it in BindingDB:
Activity Spreadsheet -- Enzyme Inhibition Constant Data from BindingDB
Found 2 hits for monomerid = 50383881
TargetArachidonate 5-lipoxygenase-activating protein(Homo sapiens (Human))
Merck Research Laboratories
Curated by ChEMBL
LigandPNGBDBM50383881(CHEMBL2031457)
Affinity DataIC50:  48nM. Assay description: Displacement of [125I]L-691,831 from 5-lipoxygenase-activating protein in human polymorphonuclear cells
In DepthDetails ArticlePubMed
TargetArachidonate 5-lipoxygenase-activating protein(Homo sapiens (Human))
Merck Research Laboratories
Curated by ChEMBL
LigandPNGBDBM50383881(CHEMBL2031457)
Affinity DataIC50:  964nM. Assay description: Inhibition of 5-lipoxygenase-activating protein in human polymorphonuclear cells assessed as inhibition of calcium ionophore-induced LTB4 production ...
In DepthDetails ArticlePubMed