BDBM50383882 CHEMBL2031661
SMILES CC1CC(C1)(c1ccccc1)c1cc(OCc2ccc3ccccc3n2)ccc1-c1n[nH]c(=O)o1
InChI Key InChIKey=SSLZKOMLCQQPKR-UHFFFAOYSA-N
Data  2 IC50
  Tab Delimited (TSV)   2D SDfile   Computed 3D by Vconf -m prep SDfile
Find this compound or compounds like it in BindingDB:
Activity Spreadsheet -- Enzyme Inhibition Constant Data from BindingDB
Found 2 hits for monomerid = 50383882
TargetArachidonate 5-lipoxygenase-activating protein(Homo sapiens (Human))
Merck Research Laboratories
Curated by ChEMBL
LigandPNGBDBM50383882(CHEMBL2031661)
Affinity DataIC50:  2.60nM. Assay description: Displacement of [125I]L-691,831 from 5-lipoxygenase-activating protein in human polymorphonuclear cells
In DepthDetails ArticlePubMed
TargetArachidonate 5-lipoxygenase-activating protein(Homo sapiens (Human))
Merck Research Laboratories
Curated by ChEMBL
LigandPNGBDBM50383882(CHEMBL2031661)
Affinity DataIC50:  695nM. Assay description: Inhibition of 5-lipoxygenase-activating protein in human polymorphonuclear cells assessed as inhibition of calcium ionophore-induced LTB4 production ...
In DepthDetails ArticlePubMed