BDBM503839 US11034692, Compound 122::trans-N-[8-amino-6-(4-methyl-3-pyridyl)- 2,7-naphthyridin-3-yl]-2-(1H-pyrazol-4- yl)cyclopropanecarboxamide
SMILES Cc1ccncc1-c1cc2cc(NC(=O)C3C[C@@H]3c3cn[nH]c3)ncc2c(N)n1
InChI Key
Data  1 KI
  Tab Delimited (TSV)   2D SDfile   Computed 3D by Vconf -m prep SDfile
Find this compound or compounds like it in BindingDB:
Activity Spreadsheet -- Enzyme Inhibition Constant Data from BindingDB
Found 1 hit for monomerid = 503839
TargetMitogen-activated protein kinase kinase kinase kinase 1(Homo sapiens (Human))
Genentech
US Patent
LigandPNGBDBM503839(US11034692, Compound 122 | trans-N-[8-amino-6-(4-m...)
Affinity DataKi:  0.0630nM. Assay description: Lanth: For the binding assay, 4 ul 2×HPK1 and Eu-anti-GST antibody were added to each well of the assay plate using a Multidrop reagent dispenser. Th...
Ligand InfoPC cidPC sid
In DepthDetails US Patent